Reaction Details
TargetReverse transcriptase/RNaseH
LigandBDBM50369527
Substrate/Competitorn/a
Meas. Tech.ChEMBL_197433 (CHEMBL802399)
IC50>100000±n/a nM
Citation Porcari, ARPtak, RGBorysko, KZBreitenbach, JMVittori, SWotring, LLDrach, JCTownsend, LB Deoxy sugar analogues of triciribine: correlation of antiviral and antiproliferative activity with intracellular phosphorylation. J Med Chem43:2438-48 (2000) Reverse transcriptase/RNaseH
Name:Reverse transcriptase/RNaseH
Type:PROTEIN
Mol. Mass.:65229.15
Organism:Human immunodeficiency virus 1
Description:ChEMBL_1473730
Residue:566
BDBM50369527
NameBDBM50369527
Synonyms:CHEMBL609194
TypeSmall organic molecule
Emp. Form.C13H16N6O3
Mol. Mass.304.3045
SMILESC[C@H]1OC([C@H](O)[C@@H]1O)n1cc2c(N)nn(C)c3ncnc1c23