Reaction Details
TargetReverse transcriptase/RNaseH
LigandBDBM50369531
Substrate/Competitorn/a
Meas. Tech.ChEMBL_197431 (CHEMBL802397)
IC50>100000±n/a nM
Citation Porcari, ARPtak, RGBorysko, KZBreitenbach, JMDrach, JCTownsend, LB 6-N-Acyltriciribine analogues: structure-activity relationship between acyl carbon chain length and activity against HIV-1. J Med Chem43:2457-63 (2000) Reverse transcriptase/RNaseH
Name:Reverse transcriptase/RNaseH
Type:PROTEIN
Mol. Mass.:65229.15
Organism:Human immunodeficiency virus 1
Description:ChEMBL_1473730
Residue:566
BDBM50369531
NameBDBM50369531
Synonyms:CHEMBL608900
TypeSmall organic molecule
Emp. Form.C20H20N6O5
Mol. Mass.424.41
SMILESCn1nc(NC(=O)c2ccccc2)c2cn(C3O[C@H](CO)[C@@H](O)[C@H]3O)c3ncnc1c23