Reaction Details
TargetReverse transcriptase/RNaseH
LigandBDBM50369540
Substrate/Competitorn/a
Meas. Tech.ChEMBL_197431 (CHEMBL802397)
IC50 800±n/a nM
Citation Porcari, ARPtak, RGBorysko, KZBreitenbach, JMDrach, JCTownsend, LB 6-N-Acyltriciribine analogues: structure-activity relationship between acyl carbon chain length and activity against HIV-1. J Med Chem43:2457-63 (2000) Reverse transcriptase/RNaseH
Name:Reverse transcriptase/RNaseH
Type:PROTEIN
Mol. Mass.:65229.15
Organism:Human immunodeficiency virus 1
Description:ChEMBL_1473730
Residue:566
BDBM50369540
NameBDBM50369540
Synonyms:CHEMBL608301
TypeSmall organic molecule
Emp. Form.C18H24N6O5
Mol. Mass.404.4204
SMILESCCCCC(=O)Nc1nn(C)c2ncnc3n(cc1c23)C1O[C@H](CO)[C@@H](O)[C@H]1O