Reaction Details
TargetDelta-type opioid receptor/Kappa-type opioid receptor/Mu-type opioid receptor/Sigma non-opioid intracellular receptor 1
LigandBDBM50369571
Substrate/Competitorn/a
Meas. Tech.ChEMBL_146137 (CHEMBL754143)
IC50 2.7±n/a nM
Citation Bilsky, EJEgleton, RDMitchell, SAPalian, MMDavis, PHuber, JDJones, HYamamura, HIJanders, JDavis, TPPorreca, FHruby, VJPolt, R Enkephalin glycopeptide analogues produce analgesia with reduced dependence liability. J Med Chem43:2586-90 (2000) Delta-type opioid receptor/Kappa-type opioid receptor/Mu-type opioid receptor/Sigma non-opioid intracellular receptor 1
Name:Delta-type opioid receptor/Kappa-type opioid receptor/Mu-type opioid receptor/Sigma non-opioid intracellular receptor 1
Synonyms:Opioid receptor
Type:n/a
Mol. Mass.:n/a
Description:ASSAY_ID of ChEMBL is 146137
Components:This complex has 4 components.
Component 1
Name:Sigma non-opioid intracellular receptor 1
Type:Enzyme Catalytic Domain
Mol. Mass.:25246.51
Organism:Mus musculus (Mouse)
Description:O55242
Residue:223
Component 2
Name:Mu-type opioid receptor
Synonyms:M-OR-1 Mor OPRM_MOUSE Oprm | Oprm1
Type:Enzyme Catalytic Domain
Mol. Mass.:44431.62
Organism:MOUSE
Description:OPIATE Mu OPRM1 MOUSE::P42866
Residue:398
Component 3
Name:Kappa-type opioid receptor
Synonyms:KOR-1 OPIATE Kappa Oprk1
Type:Enzyme
Mol. Mass.:42656.78
Organism:Mus musculus (Mouse)
Description:P33534
Residue:380
Component 4
Name:Delta-type opioid receptor
Synonyms:DOR-1 MSL-2 OPRD_MOUSE Oprd1
Type:Enzyme Catalytic Domain
Mol. Mass.:40577.25
Organism:MOUSE
Description:P32300
Residue:372
BDBM50369571
NameBDBM50369571
Synonyms:CHEMBL1790710
TypeSmall organic molecule
Emp. Form.C33H47N7O9
Mol. Mass.685.7678
SMILESCC(C)C[C@H](NC(=O)[C@H](Cc1ccccc1)NC(=O)CNC(=O)[C@H](NC(=O)[C@@H](N)Cc1ccc(O)cc1)[C@@H](C)O)C(=O)N[C@@H](CO)C(N)=O