Reaction Details
TargetMetabotropic glutamate receptor 6
LigandBDBM50060719
Substrate/Competitorn/a
Meas. Tech.ChEMBL_104311 (CHEMBL718130)
Ki 58000±n/a nM
Citation Bräuner-Osborne, HEgebjerg, JNielsen, EOMadsen, UKrogsgaard-Larsen, P Ligands for glutamate receptors: design and therapeutic prospects. J Med Chem43:2609-45 (2000) Metabotropic glutamate receptor 6
Name:Metabotropic glutamate receptor 6
Type:Enzyme Catalytic Domain
Mol. Mass.:95479.26
Organism:Homo sapiens (Human)
Description:metabotropic glutamate 6 GRM6 HUMAN::O15303
Residue:877
BDBM50060719
NameBDBM50060719
Synonyms:(S)-2-Amino-4-(3-hydroxy-5-methyl-isoxazol-4-yl)-butyric acid 2-Amino-4-(3-hydroxy-5-methyl-isoxazol-4-yl)-butyric acid(S-homo-AMPA) | CHEMBL315268
TypeSmall organic molecule
Emp. Form.C8H12N2O4
Mol. Mass.200.1919
SMILESCc1o[nH]c(=O)c1CC[C@H](N)C(O)=O