Reaction Details
TargetMetabotropic glutamate receptor 8
LigandBDBM86213
Substrate/Competitorn/a
Meas. Tech.ChEMBL_104492 (CHEMBL712473)
Ki>100000±n/a nM
Citation Bräuner-Osborne, HEgebjerg, JNielsen, EOMadsen, UKrogsgaard-Larsen, P Ligands for glutamate receptors: design and therapeutic prospects. J Med Chem43:2609-45 (2000) Metabotropic glutamate receptor 8
Name:Metabotropic glutamate receptor 8
Type:Enzyme Catalytic Domain
Mol. Mass.:101759.58
Organism:Homo sapiens (Human)
Description:metabotropic glutamate 8 GRM8 HUMAN::O00222
Residue:908
BDBM86213
NameBDBM86213
Synonyms:CAS_5126051 CPCCOEt | NSC_5126051
TypeSmall organic molecule
Emp. Form.C13H13NO4
Mol. Mass.247.2466
SMILESCCOC(=O)C12CC1C(N=O)c1ccccc1O2