Reaction Details
TargetMetabotropic glutamate receptor 5
LigandBDBM17660
Substrate/Competitorn/a
Meas. Tech.ChEMBL_104277 (CHEMBL711712)
Ki 55±n/a nM
Citation Bräuner-Osborne, HEgebjerg, JNielsen, EOMadsen, UKrogsgaard-Larsen, P Ligands for glutamate receptors: design and therapeutic prospects. J Med Chem43:2609-45 (2000) Metabotropic glutamate receptor 5
Name:Metabotropic glutamate receptor 5
Type:Enzyme
Mol. Mass.:132484.72
Organism:Homo sapiens (Human)
Description:n/a
Residue:1212
BDBM17660
NameBDBM17660
Synonyms:(2S)-2-amino-3-(3,5-dioxo-1,2,4-oxadiazolidin-2-yl)propanoic acid CHEMBL279956 Quisqualate, L | quisqualic acid
TypeSmall organic molecule
Emp. Form.C5H7N3O5
Mol. Mass.189.1262
SMILESN[C@@H](Cn1oc(=O)[nH]c1=O)C(O)=O