Reaction Details
TargetMetabotropic glutamate receptor 6
LigandBDBM50089891
Substrate/Competitorn/a
Meas. Tech.ChEMBL_104311 (CHEMBL718130)
Ki>1000000±n/a nM
Citation Bräuner-Osborne, HEgebjerg, JNielsen, EOMadsen, UKrogsgaard-Larsen, P Ligands for glutamate receptors: design and therapeutic prospects. J Med Chem43:2609-45 (2000) Metabotropic glutamate receptor 6
Name:Metabotropic glutamate receptor 6
Type:Enzyme Catalytic Domain
Mol. Mass.:95479.26
Organism:Homo sapiens (Human)
Description:metabotropic glutamate 6 GRM6 HUMAN::O15303
Residue:877
BDBM50089891
NameBDBM50089891
Synonyms:2-Amino-3-(3-hydroxy-5-oxo-[1,2,4]oxadiazol-4-yl)-2-methyl-propionic acid(S-MetQUIS) | CHEMBL313713
TypeSmall organic molecule
Emp. Form.C6H9N3O5
Mol. Mass.203.1528
SMILESC[C@](N)(Cn1c(=O)[nH]oc1=O)C(O)=O