Reaction Details
TargetMetabotropic glutamate receptor 8
LigandBDBM50079183
Substrate/Competitorn/a
Meas. Tech.ChEMBL_104492 (CHEMBL712473)
Ki>1000000±n/a nM
Citation Bräuner-Osborne, HEgebjerg, JNielsen, EOMadsen, UKrogsgaard-Larsen, P Ligands for glutamate receptors: design and therapeutic prospects. J Med Chem43:2609-45 (2000) Metabotropic glutamate receptor 8
Name:Metabotropic glutamate receptor 8
Type:Enzyme Catalytic Domain
Mol. Mass.:101759.58
Organism:Homo sapiens (Human)
Description:metabotropic glutamate 8 GRM8 HUMAN::O00222
Residue:908
BDBM50079183
NameBDBM50079183
Synonyms:(2S)-amino(3,5-dihydroxyphenyl)ethanoic acid (S)-Amino-(3,5-dihydroxy-phenyl)-acetic acid Amino-(3,5-dihydroxy-phenyl)-acetic acid CHEMBL39221 | amino(3,5-dihydroxyphenyl)acetic acid
TypeSmall organic molecule
Emp. Form.C8H9NO4
Mol. Mass.183.1614
SMILESN[C@H](C(O)=O)c1cc(O)cc(O)c1