Reaction Details
TargetMetabotropic glutamate receptor 8
LigandBDBM86717
Substrate/Competitorn/a
Meas. Tech.ChEMBL_104492 (CHEMBL712473)
Ki>100000±n/a nM
Citation Bräuner-Osborne, HEgebjerg, JNielsen, EOMadsen, UKrogsgaard-Larsen, P Ligands for glutamate receptors: design and therapeutic prospects. J Med Chem43:2609-45 (2000) Metabotropic glutamate receptor 8
Name:Metabotropic glutamate receptor 8
Type:Enzyme Catalytic Domain
Mol. Mass.:101759.58
Organism:Homo sapiens (Human)
Description:metabotropic glutamate 8 GRM8 HUMAN::O00222
Residue:908
BDBM86717
NameBDBM86717
Synonyms:CAS_5218788 NSC_5218788 | SIB-1757
TypeSmall organic molecule
Emp. Form.C12H11N3O
Mol. Mass.213.2352
SMILESCc1ccc(O)c(N=Nc2ccccc2)n1