Reaction Details
TargetMetabotropic glutamate receptor 8
LigandBDBM50052398
Substrate/Competitorn/a
Meas. Tech.ChEMBL_104492 (CHEMBL712473)
Ki>100000±n/a nM
Citation Bräuner-Osborne, HEgebjerg, JNielsen, EOMadsen, UKrogsgaard-Larsen, P Ligands for glutamate receptors: design and therapeutic prospects. J Med Chem43:2609-45 (2000) Metabotropic glutamate receptor 8
Name:Metabotropic glutamate receptor 8
Type:Enzyme Catalytic Domain
Mol. Mass.:101759.58
Organism:Homo sapiens (Human)
Description:metabotropic glutamate 8 GRM8 HUMAN::O00222
Residue:908
BDBM50052398
NameBDBM50052398
Synonyms:(2R,4R)-4-aminopyrrolidine-2,4-dicarboxylic acid 2R, 4R-APDC | CHEMBL40086
TypeSmall organic molecule
Emp. Form.C6H10N2O4
Mol. Mass.174.1546
SMILESN[C@]1(CN[C@H](C1)C(O)=O)C(O)=O