Reaction Details
TargetMetabotropic glutamate receptor 3
LigandBDBM50089897
Substrate/Competitorn/a
Meas. Tech.ChEMBL_106383 (CHEMBL717238)
Ki 7.6±n/a nM
Citation Bräuner-Osborne, HEgebjerg, JNielsen, EOMadsen, UKrogsgaard-Larsen, P Ligands for glutamate receptors: design and therapeutic prospects. J Med Chem43:2609-45 (2000) Metabotropic glutamate receptor 3
Name:Metabotropic glutamate receptor 3
Type:Enzyme Catalytic Domain
Mol. Mass.:98889.09
Organism:Homo sapiens (Human)
Description:metabotropic glutamate 1c 0 HUMAN::Q14832
Residue:879
BDBM50089897
NameBDBM50089897
Synonyms:4-Amino-2-thia-bicyclo[3.1.0]hexane-4,6-dicarboxylic acid(LY389795) | CHEMBL88999
TypeSmall organic molecule
Emp. Form.C7H9NO4S
Mol. Mass.203.216
SMILESN[C@]1(CSC2[C@@H](C12)C(O)=O)C(O)=O