Reaction Details
TargetMetabotropic glutamate receptor 3
LigandBDBM50007548
Substrate/Competitorn/a
Meas. Tech.ChEMBL_106383 (CHEMBL717238)
Ki>1000000±n/a nM
Citation Bräuner-Osborne, HEgebjerg, JNielsen, EOMadsen, UKrogsgaard-Larsen, P Ligands for glutamate receptors: design and therapeutic prospects. J Med Chem43:2609-45 (2000) Metabotropic glutamate receptor 3
Name:Metabotropic glutamate receptor 3
Type:Enzyme Catalytic Domain
Mol. Mass.:98889.09
Organism:Homo sapiens (Human)
Description:metabotropic glutamate 1c 0 HUMAN::Q14832
Residue:879
BDBM50007548
NameBDBM50007548
Synonyms:(S)-2-Amino-4-phosphono-butyric acid 2-Amino-3-(3,5-dioxo-[1,2,4]oxadiazolidin-2-yl)-propionic acid 2-Amino-4-phosphono-butyric acid(S-AP4) 2-amino-4-phosphonobutyric acid L-(+)-2-amino-4-phosphonobutyric acid L-AP4 | L-APB
TypeSmall organic molecule
Emp. Form.C4H10NO5P
Mol. Mass.183.0997
SMILESN[C@@H](CCP(O)(O)=O)C(O)=O