Reaction Details
TargetDelta-type opioid receptor
LigandBDBM50090002
Substrate/Competitorn/a
Meas. Tech.ChEMBL_145485 (CHEMBL752128)
Ki 2.9±n/a nM
Citation Schlechtingen, GZhang, LMaycock, ADeHaven, RNDaubert, JDCassel, JChung, NNSchiller, PWGoodman, M [Pro(3)]Dyn A(1-11)-NH(2): a dynorphin analogue with high selectivity for the kappa opioid receptor. J Med Chem43:2698-702 (2000) Delta-type opioid receptor
Name:Delta-type opioid receptor
Type:G Protein-Coupled Receptor (GPCR)
Mol. Mass.:40382.98
Organism:Homo sapiens (Human)
Description:Competition binding assays were carried out using membrane preparations from transfected HN9.10 cells that constitutively expressed the delta opioid receptor.
Residue:372
BDBM50090002
NameBDBM50090002
Synonyms:CHEMBL411003 Tyr-Gly-Gly-Phe-Leu-Arg-Arg-Ile-Arg-Pro-Lys-NH2
TypeSmall organic molecule
Emp. Form.C63H104N22O12
Mol. Mass.1361.6401
SMILESCC[C@H](C)[C@H](NC(=O)[C@H](CCCNC(N)=N)NC(=O)[C@H](CCCNC(N)=N)NC(=O)[C@H](CC(C)C)NC(=O)[C@H](Cc1ccccc1)NC(=O)CNC(=O)CNC(=O)[C@@H](N)Cc1ccc(O)cc1)C(=O)N[C@@H](CCCNC(N)=N)C(=O)N1CCC[C@@H]1C(=O)N[C@@H](CCCCN)C(N)=O