Reaction Details
TargetDelta-type opioid receptor
LigandBDBM50090006
Substrate/Competitorn/a
Meas. Tech.ChEMBL_145486 (CHEMBL752129)
Ki 8800±n/a nM
Citation Schlechtingen, GZhang, LMaycock, ADeHaven, RNDaubert, JDCassel, JChung, NNSchiller, PWGoodman, M [Pro(3)]Dyn A(1-11)-NH(2): a dynorphin analogue with high selectivity for the kappa opioid receptor. J Med Chem43:2698-702 (2000) Delta-type opioid receptor
Name:Delta-type opioid receptor
Type:G Protein-Coupled Receptor (GPCR)
Mol. Mass.:40382.98
Organism:Homo sapiens (Human)
Description:Competition binding assays were carried out using membrane preparations from transfected HN9.10 cells that constitutively expressed the delta opioid receptor.
Residue:372
BDBM50090006
NameBDBM50090006
Synonyms:CHEMBL407389 | [Pro3] Dynorphin A (1-11)-NH2H-Tyr-Gly-Pro-Phe-Leu-Arg-Arg-Ile-Arg-Pro-Lys-NH2
TypeSmall organic molecule
Emp. Form.C66H108N22O12
Mol. Mass.1401.7039
SMILESCC[C@H](C)[C@H](NC(=O)[C@H](CCCNC(N)=N)NC(=O)[C@H](CCCNC(N)=N)NC(=O)[C@H](CC(C)C)NC(=O)[C@H](Cc1ccccc1)NC(=O)[C@H]1CCCN1C(=O)CNC(=O)[C@@H](N)Cc1ccc(O)cc1)C(=O)N[C@@H](CCCNC(N)=N)C(=O)N1CCC[C@@H]1C(=O)N[C@@H](CCCCN)C(N)=O