Reaction Details
TargetAdenosine receptor A3
LigandBDBM50090684
Substrate/Competitorn/a
Meas. Tech.ChEMBL_31246 (CHEMBL642211)
Ki>10000±n/a nM
Citation Ferrarini, PLMori, CManera, CMartinelli, AMori, FSaccomanni, GBarili, PLBetti, LGiannaccini, GTrincavelli, LLucacchini, A A novel class of highly potent and selective A1 adenosine antagonists: structure-affinity profile of a series of 1,8-naphthyridine derivatives. J Med Chem43:2814-23 (2000) Adenosine receptor A3
Name:Adenosine receptor A3
Type:PROTEIN
Mol. Mass.:36643.73
Organism:Rattus norvegicus
Description:ChEMBL_479910
Residue:320
BDBM50090684
NameBDBM50090684
Synonyms:7-Methoxy-2-phenyl-[1,8]naphthyridin-4-ol CHEMBL329294
TypeSmall organic molecule
Emp. Form.C15H12N2O2
Mol. Mass.252.268
SMILESCOc1ccc2c(O)cc(nc2n1)-c1ccccc1