Reaction Details
TargetAdenosine receptor A1
LigandBDBM50059101
Substrate/Competitorn/a
Meas. Tech.ChEMBL_29105 (CHEMBL638717)
Ki 5.3±n/a nM
Citation Ferrarini, PLMori, CManera, CMartinelli, AMori, FSaccomanni, GBarili, PLBetti, LGiannaccini, GTrincavelli, LLucacchini, A A novel class of highly potent and selective A1 adenosine antagonists: structure-affinity profile of a series of 1,8-naphthyridine derivatives. J Med Chem43:2814-23 (2000) Adenosine receptor A1
Name:Adenosine receptor A1
Type:Enzyme Catalytic Domain
Mol. Mass.:36602.99
Organism:BOVINE
Description:ADENOSINE 0 BOVINE::P28190
Residue:326
BDBM50059101
NameBDBM50059101
Synonyms:2-(4-Fluoro-phenyl)-7-methyl-1H-[1,8]naphthyridin-4-one 2-(4-fluorophenyl)-7-methyl-1,8-naphthyridin-4-ol | CHEMBL313864
TypeSmall organic molecule
Emp. Form.C15H11FN2O
Mol. Mass.254.259
SMILESCc1ccc2c(O)cc(nc2n1)-c1ccc(F)cc1