Reaction Details
TargetAdenosine receptor A2a
LigandBDBM50090698
Substrate/Competitorn/a
Meas. Tech.ChEMBL_31046 (CHEMBL642117)
Ki 1800±n/a nM
Citation Ferrarini, PLMori, CManera, CMartinelli, AMori, FSaccomanni, GBarili, PLBetti, LGiannaccini, GTrincavelli, LLucacchini, A A novel class of highly potent and selective A1 adenosine antagonists: structure-affinity profile of a series of 1,8-naphthyridine derivatives. J Med Chem43:2814-23 (2000) Adenosine receptor A2a
Name:Adenosine receptor A2a
Type:G Protein-Coupled Receptor (GPCR)
Mol. Mass.:44716.46
Organism:Homo sapiens (Human)
Description:P29274
Residue:412
BDBM50090698
NameBDBM50090698
Synonyms:(7-Methyl-2-phenyl-[1,8]naphthyridin-4-yl)-hydrazine CHEMBL94538
TypeSmall organic molecule
Emp. Form.C15H14N4
Mol. Mass.250.2985
SMILESCc1ccc2c(NN)cc(nc2n1)-c1ccccc1