Reaction Details
TargetAdenosine receptor A2a
LigandBDBM50090700
Substrate/Competitorn/a
Meas. Tech.ChEMBL_31046 (CHEMBL642117)
Ki 66±n/a nM
Citation Ferrarini, PLMori, CManera, CMartinelli, AMori, FSaccomanni, GBarili, PLBetti, LGiannaccini, GTrincavelli, LLucacchini, A A novel class of highly potent and selective A1 adenosine antagonists: structure-affinity profile of a series of 1,8-naphthyridine derivatives. J Med Chem43:2814-23 (2000) Adenosine receptor A2a
Name:Adenosine receptor A2a
Type:G Protein-Coupled Receptor (GPCR)
Mol. Mass.:44716.46
Organism:Homo sapiens (Human)
Description:P29274
Residue:412
BDBM50090700
NameBDBM50090700
Synonyms:7-Bromo-2-phenyl-[1,8]naphthyridin-4-ol CHEMBL97687
TypeSmall organic molecule
Emp. Form.C14H9BrN2O
Mol. Mass.301.138
SMILESOc1cc(nc2nc(Br)ccc12)-c1ccccc1