Reaction Details
TargetAdenosine receptor A1
LigandBDBM50090689
Substrate/Competitorn/a
Meas. Tech.ChEMBL_29104 (CHEMBL638716)
Ki 1000±n/a nM
Citation Ferrarini, PLMori, CManera, CMartinelli, AMori, FSaccomanni, GBarili, PLBetti, LGiannaccini, GTrincavelli, LLucacchini, A A novel class of highly potent and selective A1 adenosine antagonists: structure-affinity profile of a series of 1,8-naphthyridine derivatives. J Med Chem43:2814-23 (2000) Adenosine receptor A1
Name:Adenosine receptor A1
Type:Enzyme Catalytic Domain
Mol. Mass.:36602.99
Organism:BOVINE
Description:ADENOSINE 0 BOVINE::P28190
Residue:326
BDBM50090689
NameBDBM50090689
Synonyms:4-Chloro-7-methyl-2-phenyl-[1,8]naphthyridine CHEMBL97778
TypeSmall organic molecule
Emp. Form.C15H11ClN2
Mol. Mass.254.714
SMILESCc1ccc2c(Cl)cc(nc2n1)-c1ccccc1