Reaction Details
TargetAdenosine receptor A1
LigandBDBM50090709
Substrate/Competitorn/a
Meas. Tech.ChEMBL_29105 (CHEMBL638717)
Ki 4.1±n/a nM
Citation Ferrarini, PLMori, CManera, CMartinelli, AMori, FSaccomanni, GBarili, PLBetti, LGiannaccini, GTrincavelli, LLucacchini, A A novel class of highly potent and selective A1 adenosine antagonists: structure-affinity profile of a series of 1,8-naphthyridine derivatives. J Med Chem43:2814-23 (2000) Adenosine receptor A1
Name:Adenosine receptor A1
Type:Enzyme Catalytic Domain
Mol. Mass.:36602.99
Organism:BOVINE
Description:ADENOSINE 0 BOVINE::P28190
Residue:326
BDBM50090709
NameBDBM50090709
Synonyms:7-Fluoro-2-phenyl-[1,8]naphthyridin-4-ol | CHEMBL97757
TypeSmall organic molecule
Emp. Form.C14H9FN2O
Mol. Mass.240.2325
SMILESOc1cc(nc2nc(F)ccc12)-c1ccccc1