Reaction Details
TargetD(4) dopamine receptor
LigandBDBM50010586
Substrate/Competitorn/a
Meas. Tech.ChEMBL_60821 (CHEMBL872784)
Ki 169±n/a nM
Citation van Vliet, LARodenhuis, NDijkstra, DWikström, HPugsley, TASerpa, KAMeltzer, LTHeffner, TGWise, LDLajiness, MEHuff, RMSvensson, KSundell, SLundmark, M Synthesis and pharmacological evaluation of thiopyran analogues of the dopamine D3 receptor-selective agonist (4aR,10bR)-(+)-trans-3,4,4a,10b-tetrahydro-4-n-propyl-2H,5H [1]b enzopyrano[4,3-b]-1,4-oxazin-9-ol (PD 128907). J Med Chem43:2871-82 (2000) D(4) dopamine receptor
Name:D(4) dopamine receptor
Type:Enzyme
Mol. Mass.:48373.19
Organism:Homo sapiens (Human)
Description:P21917
Residue:419
BDBM50010586
NameBDBM50010586
Synonyms:(+)-1-Propyl-2,3,10,10a-tetrahydro-1H,4aH-4,9-dioxa-1-aza-phenanthren-6-ol (4aR,10aR)-1-Propyl-2,3,10,10a-tetrahydro-1H,4aH-4,9-dioxa-1-aza-phenanthren-6-ol (trans)1-Propyl-2,3,10,10a-tetrahydro-1H,4aH-4,9-dioxa-1-aza-phenanthren-6-ol (PD 128907) CHEMBL70565 | PD 128,907
TypeSmall organic molecule
Emp. Form.C14H19NO3
Mol. Mass.249.3056
SMILESCCCN1CCO[C@H]2[C@H]1COc1ccc(O)cc21