Reaction Details
Target5-hydroxytryptamine receptor 1A
LigandBDBM50090828
Substrate/Competitorn/a
Meas. Tech.ChEMBL_1442 (CHEMBL616315)
Ki 30±n/a nM
Citation van Vliet, LARodenhuis, NDijkstra, DWikström, HPugsley, TASerpa, KAMeltzer, LTHeffner, TGWise, LDLajiness, MEHuff, RMSvensson, KSundell, SLundmark, M Synthesis and pharmacological evaluation of thiopyran analogues of the dopamine D3 receptor-selective agonist (4aR,10bR)-(+)-trans-3,4,4a,10b-tetrahydro-4-n-propyl-2H,5H [1]b enzopyrano[4,3-b]-1,4-oxazin-9-ol (PD 128907). J Med Chem43:2871-82 (2000) 5-hydroxytryptamine receptor 1A
Name:5-hydroxytryptamine receptor 1A
Type:G Protein-Coupled Receptor (GPCR)
Mol. Mass.:46445.29
Organism:Rattus norvegicus (rat)
Description:Binding assays were performed using rat hippocampal membranes.
Residue:422
BDBM50090828
NameBDBM50090828
Synonyms:(-)-1-Propyl-2,3,10,10a-tetrahydro-1H,4aH-4-oxa-9-thia-1-aza-phenanthren-6-ol | CHEMBL98305
TypeSmall organic molecule
Emp. Form.C14H19NO2S
Mol. Mass.265.371
SMILESCCCN1CCO[C@H]2[C@H]1CSc1ccc(O)cc21