Reaction Details
TargetKappa-type opioid receptor
LigandBDBM50091002
Substrate/Competitorn/a
Meas. Tech.ChEMBL_145508 (CHEMBL752150)
Ki 5.3±n/a nM
Citation Ronsisvalle, GPasquinucci, LPittalà, VMarrazzo, APrezzavento, ODi Toro, RFalcucci, BSpampinato, S Nonpeptide analogues of dynorphin A(1-8): design, synthesis, and pharmacological evaluation of kappa-selective agonists. J Med Chem43:2992-3004 (2000) Kappa-type opioid receptor
Name:Kappa-type opioid receptor
Type:G Protein-Coupled Receptor (GPCR)
Mol. Mass.:42744.99
Organism:Cavia porcellus (domestic guinea pig)
Description:P41144
Residue:380
BDBM50091002
NameBDBM50091002
Synonyms:2-(8-Hydroxy-6,11-dimethyl-1,2,5,6-tetrahydro-4H-2,6-methano-benzo[d]azocin-3-ylmethyl)-1-phenyl-cyclopropanecarboxylic acid {[3-methyl-1-(6-pentanimidoylamino-hexylcarbamoyl)-butylcarbamoyl]-methyl}-amide | CHEMBL406036
TypeSmall organic molecule
Emp. Form.C44H66N6O4
Mol. Mass.743.0326
SMILESCCCCC(=N)NCCCCCCNC(=O)C(CC(C)C)NC(=O)CNC(=O)[C@@]1(CC1CN1CC[C@]2(C)C(C)C1Cc1ccc(O)cc21)c1ccccc1