Reaction Details
TargetD(2) dopamine receptor
LigandBDBM60917
Substrate/Competitorn/a
Meas. Tech.ChEMBL_62066 (CHEMBL672366)
Kd 1900±n/a nM
Citation Wilcox, REHuang, WHBrusniak, MYWilcox, DMPearlman, RSTeeter, MMDuRand, CJWiens, BLNeve, KA CoMFA-based prediction of agonist affinities at recombinant wild type versus serine to alanine point mutated D2 dopamine receptors. J Med Chem43:3005-19 (2000) D(2) dopamine receptor
Name:D(2) dopamine receptor
Type:G Protein-Coupled Receptor (GPCR)
Mol. Mass.:50931.60
Organism:Rattus norvegicus (rat)
Description:P61169
Residue:444
BDBM60917
NameBDBM60917
Synonyms:9-chloranyl-5-(4-hydroxyphenyl)-2,3,4,5-tetrahydro-1H-3-benzazepine-7,8-diol;methanesulfonic acid 9-chloro-5-(4-hydroxyphenyl)-2,3,4,5-tetrahydro-1H-3-benzazepine-7,8-diol;methanesulfonic acid FENOLDOPAM MESYLATE SMR000469190 | cid_49659
TypeSmall organic molecule
Emp. Form.C16H16ClNO3
Mol. Mass.305.756
SMILESOc1ccc(cc1)C1CNCCc2c(Cl)c(O)c(O)cc12