Reaction Details
TargetD(2) dopamine receptor
LigandBDBM50091035
Substrate/Competitorn/a
Meas. Tech.ChEMBL_62066 (CHEMBL672366)
Kd 225000±n/a nM
Citation Wilcox, REHuang, WHBrusniak, MYWilcox, DMPearlman, RSTeeter, MMDuRand, CJWiens, BLNeve, KA CoMFA-based prediction of agonist affinities at recombinant wild type versus serine to alanine point mutated D2 dopamine receptors. J Med Chem43:3005-19 (2000) D(2) dopamine receptor
Name:D(2) dopamine receptor
Type:G Protein-Coupled Receptor (GPCR)
Mol. Mass.:50931.60
Organism:Rattus norvegicus (rat)
Description:P61169
Residue:444
BDBM50091035
NameBDBM50091035
Synonyms:2-(4-Hydroxy-3-methoxy-phenyl)-ethyl-ammonium(3-methoxytyramine) | 3-O-methyldopamine
TypeSmall organic molecule
Emp. Form.C9H14NO2
Mol. Mass.168.2124
SMILESCOc1cc(CC[NH3+])ccc1O