Reaction Details
TargetTrypanothione reductase
LigandBDBM50091165
Substrate/Competitorn/a
Meas. Tech.ChEMBL_211806 (CHEMBL811878)
Ki 470±n/a nM
Citation Khan, MOAustin, SEChan, CYin, HMarks, DVaghjiani, SNKendrick, HYardley, VCroft, SLDouglas, KT Use of an additional hydrophobic binding site, the Z site, in the rational drug design of a new class of stronger trypanothione reductase inhibitor, quaternary alkylammonium phenothiazines. J Med Chem43:3148-56 (2000) Trypanothione reductase
Name:Trypanothione reductase
Type:Homodimer; oxidoreductase
Mol. Mass.:53868.26
Organism:Trypanosoma cruzi
Description:n/a
Residue:492
BDBM50091165
NameBDBM50091165
Synonyms:(4-Benzyloxy-benzyl)-[3-(2-chloro-phenothiazin-10-yl)-propyl]-dimethyl-ammonium (OFK025) | CHEMBL323210
TypeSmall organic molecule
Emp. Form.C31H32ClN2OS
Mol. Mass.516.116
SMILESC[N+](C)(CCCN1c2ccccc2Sc2ccc(Cl)cc12)Cc1ccc(OCc2ccccc2)cc1