Reaction Details
TargetAndrogen receptor
LigandBDBM26258
Substrate/Competitorn/a
Meas. Tech.ChEMBL_36428 (CHEMBL649839)
Ki 0.75±n/a nM
Citation Van Dort, MERobins, DMWayburn, B Design, synthesis, and pharmacological characterization of 4-[4, 4-dimethyl-3-(4-hydroxybutyl)-5-oxo-2-thioxo-1-imidazolidinyl]- 2-iodobenzonitrile as a high-affinity nonsteroidal androgen receptor ligand. J Med Chem43:3344-7 (2000) Androgen receptor
Name:Androgen receptor
Type:Enzyme
Mol. Mass.:98219.08
Organism:Rattus norvegicus (Rat)
Description:P15207
Residue:902
BDBM26258
NameBDBM26258
Synonyms:(1S,2R,9R,10R,11S,14S,15S)-14-hydroxy-9,14,15-trimethyltetracyclo[8.7.0.0^{2,7}.0^{11,15}]heptadec-6-en-5-one [3H]Mibolerone
Typeradiolabeled ligand
Emp. Form.C20H30O2
Mol. Mass.302.451
SMILES[H][C@@]12CC[C@](C)(O)[C@@]1(C)CC[C@]1([H])[C@@]3([H])CCC(=O)C=C3C[C@@H](C)[C@@]21[H]