Reaction Details
TargetMu-type opioid receptor
LigandBDBM50091404
Substrate/Competitorn/a
Meas. Tech.ChEMBL_146575 (CHEMBL755064)
Ki 0.540000±n/a nM
Citation Derrick, INeilan, CLAndes, JHusbands, SMWoods, JHTraynor, JRLewis, JW 3-Deoxyclocinnamox: the first high-affinity, nonpeptide mu-opioid antagonist lacking a phenolic hydroxyl group. J Med Chem43:3348-50 (2000) Mu-type opioid receptor
Name:Mu-type opioid receptor
Type:G Protein-Coupled Receptor (GPCR)
Mol. Mass.:44789.51
Organism:Homo sapiens (Human)
Description:P35372
Residue:400
BDBM50091404
NameBDBM50091404
Synonyms:1N-[4-cyclopropylmethyl-14-oxo-(13R)-12-oxa-4-azapentacyclo[9.6.1.01,13.05,17.07,18]octadeca-7,9,11(18)-trien-17-yl]-3-(4-chlorophenyl)-(E)-2-propenamide
TypeSmall organic molecule
Emp. Form.C29H29ClN2O3
Mol. Mass.489.005
SMILESClc1ccc(\C=C\C(=O)NC23CCC(=O)C4Oc5cccc6CC2N(CC2CC2)CC[C@@]34c56)cc1