Reaction Details
TargetGag-Pol polyprotein [489-587]
LigandBDBM517
Substrate/Competitorn/a
Meas. Tech.ChEMBL_159325 (CHEMBL769378)
IC50 0.41±n/a nM
Citation Dorsey, BDMcDonough, CMcDaniel, SLLevin, RBNewton, CLHoffman, JMDarke, PLZugay-Murphy, JAEmini, EASchleif, WAOlsen, DBStahlhut, MWRutkowski, CAKuo, LCLin, JHChen, IWMichelson, SRHolloway, MKHuff, JRVacca, JP Identification of MK-944a: a second clinical candidate from the hydroxylaminepentanamide isostere series of HIV protease inhibitors. J Med Chem43:3386-99 (2000) Gag-Pol polyprotein [489-587]
Name:Gag-Pol polyprotein [489-587]
Type:Enzyme Subunit
Mol. Mass.:10781.16
Organism:Human immunodeficiency virus type 1
Description:P04585[489-587]
Residue:99
BDBM517
NameBDBM517
Synonyms:(2S)-1-[(2S,4R)-4-benzyl-2-hydroxy-4-{[(1S,2R)-2-hydroxy-2,3-dihydro-1H-inden-1-yl]carbamoyl}butyl]-N-tert-butyl-4-(pyridin-3-ylmethyl)piperazine-2-carboxamide Crixivan Indinavir L-735, 524 | MK639
TypeSmall organic molecule
Emp. Form.C36H47N5O4
Mol. Mass.613.7895
SMILESCC(C)(C)NC(=O)[C@@H]1CN(Cc2cccnc2)CCN1C[C@@H](O)C[C@@H](Cc1ccccc1)C(=O)N[C@@H]1[C@H](O)Cc2ccccc12