Reaction Details
TargetIntegrin alpha-IIb/beta-3
LigandBDBM50092109
Substrate/Competitorn/a
Meas. Tech.ChEMBL_217050 (CHEMBL824023)
IC50 130±n/a nM
Citation Scarborough, RMGretler, DD Platelet glycoprotein IIb-IIIa antagonists as prototypical integrin blockers: novel parenteral and potential oral antithrombotic agents. J Med Chem43:3453-73 (2000) Integrin alpha-IIb/beta-3
Name:Integrin alpha-IIb/beta-3
Synonyms:Glycoprotein IIb/IIIa
Type:n/a
Mol. Mass.:n/a
Description:ASSAY_ID of EBI is 30109
Components:This complex has 2 components.
Component 1
Name:Integrin beta-3
Type:Protein
Mol. Mass.:87038.91
Organism:Homo sapiens (Human)
Description:P05106
Residue:788
Component 2
Name:Integrin alpha-IIb
Synonyms:CD_antigen=CD41 GPIIb Glycoprotein IIb ITGA2B Integrin alpha-IIb heavy chain Integrin alpha-IIb light chain, form 2 Integrin alpha-V/beta-3 and alpha-IIb/beta 3 | Platelet membrane glycoprotein IIb
Type:Protein
Mol. Mass.:113354.85
Organism:Homo sapiens (Human)
Description:P08514
Residue:1039
BDBM50092109
NameBDBM50092109
Synonyms:3-{(S)-3-[1-(4-Carbamimidoyl-phenyl)-2-oxo-pyrrolidin-3-yl]-ureido}-propionic acid ethyl ester CHEMBL64706 | SC-57099B
TypeSmall organic molecule
Emp. Form.C17H23N5O4
Mol. Mass.361.3956
SMILESCCOC(=O)CCNC(=O)N[C@H]1CCN(C1=O)c1ccc(cc1)C(N)=N