Reaction Details
TargetIntegrin alpha-IIb/beta-3
LigandBDBM50092123
Substrate/Competitorn/a
Meas. Tech.ChEMBL_219989 (CHEMBL841611)
IC50 38±n/a nM
Citation Scarborough, RMGretler, DD Platelet glycoprotein IIb-IIIa antagonists as prototypical integrin blockers: novel parenteral and potential oral antithrombotic agents. J Med Chem43:3453-73 (2000) Integrin alpha-IIb/beta-3
Name:Integrin alpha-IIb/beta-3
Synonyms:Glycoprotein IIb/IIIa
Type:n/a
Mol. Mass.:n/a
Description:ASSAY_ID of EBI is 30109
Components:This complex has 2 components.
Component 1
Name:Integrin beta-3
Type:Protein
Mol. Mass.:87038.91
Organism:Homo sapiens (Human)
Description:P05106
Residue:788
Component 2
Name:Integrin alpha-IIb
Synonyms:CD_antigen=CD41 GPIIb Glycoprotein IIb ITGA2B Integrin alpha-IIb heavy chain Integrin alpha-IIb light chain, form 2 Integrin alpha-V/beta-3 and alpha-IIb/beta 3 | Platelet membrane glycoprotein IIb
Type:Protein
Mol. Mass.:113354.85
Organism:Homo sapiens (Human)
Description:P08514
Residue:1039
BDBM50092123
NameBDBM50092123
Synonyms:((S)-1-{2-[4-(N-Hydroxycarbamimidoyl)-benzoylamino]-propionyl}-piperidin-4-yloxy)-acetic acid ethyl ester CHEMBL435176 | Ro-48-3657
TypeSmall organic molecule
Emp. Form.C20H28N4O6
Mol. Mass.420.4595
SMILESCCOC(=O)COC1CCN(CC1)C(=O)[C@H](C)NC(=O)c1ccc(cc1)C(=N)NO