Reaction Details
TargetGag-Pol polyprotein [489-587]
LigandBDBM50369584
Substrate/Competitorn/a
Meas. Tech.ChEMBL_196355 (CHEMBL878547)
IC50 95±n/a nM
Citation Tyndall, JDReid, RCTyssen, DPJardine, DKTodd, BPassmore, MMarch, DRPattenden, LKBergman, DAAlewood, DHu, SHAlewood, PFBirch, CJMartin, JLFairlie, DP Synthesis, stability, antiviral activity, and protease-bound structures of substrate-mimicking constrained macrocyclic inhibitors of HIV-1 protease. J Med Chem43:3495-504 (2000) Gag-Pol polyprotein [489-587]
Name:Gag-Pol polyprotein [489-587]
Type:Enzyme Subunit
Mol. Mass.:10781.16
Organism:Human immunodeficiency virus type 1
Description:P04585[489-587]
Residue:99
BDBM50369584
NameBDBM50369584
Synonyms:CHEMBL1790230
TypeSmall organic molecule
Emp. Form.C43H54N6O6
Mol. Mass.750.9255
SMILESCC[C@@H](C)[C@@H]1NC(=O)[C@H](Cc2ccc(OCCCNC1=O)cc2)NC[C@@H](O)[C@H](Cc1ccccc1)NC(=O)[C@@H](NC(=O)c1ccc2ccccc2n1)C(C)C