Reaction Details
TargetGastrin/cholecystokinin type B receptor
LigandBDBM50092154
Substrate/Competitorn/a
Meas. Tech.ChEMBL_48262 (CHEMBL662290)
IC50 259±n/a nM
Citation Low, CMBlack, JWBroughton, HBBuck, IMDavies, JMDunstone, DJHull, RAKalindjian, SBMcDonald, IMPether, MJShankley, NPSteel, KI Development of peptide 3D structure mimetics: rational design of novel peptoid cholecystokinin receptor antagonists. J Med Chem43:3505-17 (2000) Gastrin/cholecystokinin type B receptor
Name:Gastrin/cholecystokinin type B receptor
Type:Enzyme Catalytic Domain
Mol. Mass.:49196.59
Organism:MOUSE
Description:Cholecystokinin A CCKBR MOUSE::P56481
Residue:453
BDBM50092154
NameBDBM50092154
Synonyms:3-[2-(2-Adamantan-2-yl-acetylamino)-3-(1H-indol-3-yl)-2-methyl-propionylamino]-4-phenyl-butyric acid(PD 140458) PD-140458
TypeSmall organic molecule
Emp. Form.C34H41N3O4
Mol. Mass.555.707
SMILESC[C@@](Cc1c[nH]c2ccccc12)(NC(=O)CC1C2CC3CC(C2)CC1C3)C(=O)N[C@@H](CC(O)=O)Cc1ccccc1