Reaction Details
TargetDelta-type opioid receptor
LigandBDBM50084278
Substrate/Competitorn/a
Meas. Tech.ChEMBL_145313 (CHEMBL751919)
EC50 0.300000±n/a nM
Citation Husbands, SMLewis, JW Structural determinants of efficacy for kappa opioid receptors in the orvinol series: 7,7-spiro analogues of buprenorphine. J Med Chem43:139-41 (2000) Delta-type opioid receptor
Name:Delta-type opioid receptor
Type:G Protein-Coupled Receptor (GPCR)
Mol. Mass.:40382.98
Organism:Homo sapiens (Human)
Description:Competition binding assays were carried out using membrane preparations from transfected HN9.10 cells that constitutively expressed the delta opioid receptor.
Residue:372
BDBM50084278
NameBDBM50084278
Synonyms:7,7-Spiro analogue ofBuprinorphine | CHEMBL281986
TypeSmall organic molecule
Emp. Form.C27H33NO4
Mol. Mass.435.5552
SMILESCO[C@]12C=CC3(CC11CCC[C@H]1O)C1Cc4ccc(O)c5O[C@H]2C3(CCN1CC1CC1)c45