Reaction Details
TargetSodium-dependent serotonin transporter
LigandBDBM50084338
Substrate/Competitorn/a
Meas. Tech.ChEMBL_201369 (CHEMBL872702)
Ki 350±n/a nM
Citation Choi, SWElmaleh, DRHanson, RNFischman, AJ Novel 3-aminomethyl- and 4-aminopiperidine analogues of 1-[2-(diphenylmethoxy)ethyl]-4-(3-phenylpropyl)piperazines: synthesis and evaluation as dopamine transporter ligands. J Med Chem43:205-13 (2000) Sodium-dependent serotonin transporter
Name:Sodium-dependent serotonin transporter
Type:Multi-pass membrane protein
Mol. Mass.:70322.51
Organism:Homo sapiens (Human)
Description:P31645
Residue:630
BDBM50084338
NameBDBM50084338
Synonyms:(2-Benzhydryloxy-ethyl)-{1-[2-(4-fluoro-phenyl)-ethyl]-piperidin-3-ylmethyl}-amine | CHEMBL66112
TypeSmall organic molecule
Emp. Form.C29H35FN2O
Mol. Mass.446.5994
SMILESFc1ccc(CCN2CCCC(CNCCOC(c3ccccc3)c3ccccc3)C2)cc1