Reaction Details
TargetSodium-dependent noradrenaline transporter
LigandBDBM50084341
Substrate/Competitorn/a
Meas. Tech.ChEMBL_140881 (CHEMBL752512)
Ki 180±n/a nM
Citation Choi, SWElmaleh, DRHanson, RNFischman, AJ Novel 3-aminomethyl- and 4-aminopiperidine analogues of 1-[2-(diphenylmethoxy)ethyl]-4-(3-phenylpropyl)piperazines: synthesis and evaluation as dopamine transporter ligands. J Med Chem43:205-13 (2000) Sodium-dependent noradrenaline transporter
Name:Sodium-dependent noradrenaline transporter
Type:Multi-pass membrane protein
Mol. Mass.:69337.72
Organism:Homo sapiens (Human)
Description:P23975
Residue:617
BDBM50084341
NameBDBM50084341
Synonyms:(2-Benzhydryloxy-ethyl)-(1-benzyl-piperidin-4-yl)-amine | CHEMBL63703
TypeSmall organic molecule
Emp. Form.C27H32N2O
Mol. Mass.400.5558
SMILESC(COC(c1ccccc1)c1ccccc1)NC1CCN(Cc2ccccc2)CC1