Reaction Details
TargetSodium-dependent noradrenaline transporter
LigandBDBM50084337
Substrate/Competitorn/a
Meas. Tech.ChEMBL_140881 (CHEMBL752512)
Ki 41±n/a nM
Citation Choi, SWElmaleh, DRHanson, RNFischman, AJ Novel 3-aminomethyl- and 4-aminopiperidine analogues of 1-[2-(diphenylmethoxy)ethyl]-4-(3-phenylpropyl)piperazines: synthesis and evaluation as dopamine transporter ligands. J Med Chem43:205-13 (2000) Sodium-dependent noradrenaline transporter
Name:Sodium-dependent noradrenaline transporter
Type:Multi-pass membrane protein
Mol. Mass.:69337.72
Organism:Homo sapiens (Human)
Description:P23975
Residue:617
BDBM50084337
NameBDBM50084337
Synonyms:CHEMBL67078 | [1-(2-Benzhydryloxy-ethyl)-piperidin-3-ylmethyl]-(3-phenyl-propyl)-amine
TypeSmall organic molecule
Emp. Form.C30H38N2O
Mol. Mass.442.6355
SMILESC(CNCC1CCCN(CCOC(c2ccccc2)c2ccccc2)C1)Cc1ccccc1