Reaction Details
TargetSodium-dependent dopamine transporter
LigandBDBM22167
Substrate/Competitorn/a
Meas. Tech.ChEMBL_61655 (CHEMBL670789)
Ki 73±n/a nM
Citation Choi, SWElmaleh, DRHanson, RNFischman, AJ Novel 3-aminomethyl- and 4-aminopiperidine analogues of 1-[2-(diphenylmethoxy)ethyl]-4-(3-phenylpropyl)piperazines: synthesis and evaluation as dopamine transporter ligands. J Med Chem43:205-13 (2000) Sodium-dependent dopamine transporter
Name:Sodium-dependent dopamine transporter
Type:Multi-pass membrane protein
Mol. Mass.:68497.11
Organism:Homo sapiens (Human)
Description:Q01959
Residue:620
BDBM22167
NameBDBM22167
Synonyms:1-[2-(diphenylmethoxy)ethyl]-4-(3-phenylpropyl)piperazine CHEMBL434080 GBR-12935
TypeSmall organic molecule
Emp. Form.C28H34N2O
Mol. Mass.414.5824
SMILESC(CN1CCN(CCOC(c2ccccc2)c2ccccc2)CC1)Cc1ccccc1