Reaction Details
TargetSodium-dependent noradrenaline transporter
LigandBDBM50084339
Substrate/Competitorn/a
Meas. Tech.ChEMBL_140881 (CHEMBL752512)
Ki 42±n/a nM
Citation Choi, SWElmaleh, DRHanson, RNFischman, AJ Novel 3-aminomethyl- and 4-aminopiperidine analogues of 1-[2-(diphenylmethoxy)ethyl]-4-(3-phenylpropyl)piperazines: synthesis and evaluation as dopamine transporter ligands. J Med Chem43:205-13 (2000) Sodium-dependent noradrenaline transporter
Name:Sodium-dependent noradrenaline transporter
Type:Multi-pass membrane protein
Mol. Mass.:69337.72
Organism:Homo sapiens (Human)
Description:P23975
Residue:617
BDBM50084339
NameBDBM50084339
Synonyms:CHEMBL443797 | [1-(2-Benzhydryloxy-ethyl)-piperidin-4-yl]-methyl-(3-phenyl-propyl)-amine
TypeSmall organic molecule
Emp. Form.C30H38N2O
Mol. Mass.442.6355
SMILESCN(CCCc1ccccc1)C1CCN(CCOC(c2ccccc2)c2ccccc2)CC1