Reaction Details
TargetD(4) dopamine receptor
LigandBDBM50369663
Substrate/Competitorn/a
Meas. Tech.ChEMBL_63087 (CHEMBL676183)
IC50 68±n/a nM
Citation Zhang, XHodgetts, KRachwal, SZhao, HWasley, JWCraven, KBrodbeck, RKieltyka, AHoffman, DBacolod, MDGirard, BTran, JThurkauf, A trans-1-[(2-Phenylcyclopropyl)methyl]-4-arylpiperazines: mixed dopamine D(2)/D(4) receptor antagonists as potential antipsychotic agents. J Med Chem43:3923-32 (2000) D(4) dopamine receptor
Name:D(4) dopamine receptor
Type:Enzyme
Mol. Mass.:48373.19
Organism:Homo sapiens (Human)
Description:P21917
Residue:419
BDBM50369663
NameBDBM50369663
Synonyms:CHEMBL1202209
TypeSmall organic molecule
Emp. Form.C21H25FN2
Mol. Mass.324.435
SMILESCc1cc(F)ccc1N1CCN(C[C@H]2C[C@@H]2c2ccccc2)CC1