Reaction Details
TargetD(2) dopamine receptor
LigandBDBM50369666
Substrate/Competitorn/a
Meas. Tech.ChEMBL_59915 (CHEMBL671074)
IC50 2±n/a nM
Citation Zhang, XHodgetts, KRachwal, SZhao, HWasley, JWCraven, KBrodbeck, RKieltyka, AHoffman, DBacolod, MDGirard, BTran, JThurkauf, A trans-1-[(2-Phenylcyclopropyl)methyl]-4-arylpiperazines: mixed dopamine D(2)/D(4) receptor antagonists as potential antipsychotic agents. J Med Chem43:3923-32 (2000) D(2) dopamine receptor
Name:D(2) dopamine receptor
Type:Cell-surface receptors
Mol. Mass.:50647.10
Organism:Homo sapiens (Human)
Description:P14416
Residue:443
BDBM50369666
NameBDBM50369666
Synonyms:CHEMBL1202213
TypeSmall organic molecule
Emp. Form.C20H22Cl2N2
Mol. Mass.361.308
SMILESClc1cccc(N2CCN(C[C@H]3C[C@@H]3c3ccccc3)CC2)c1Cl