Reaction Details
TargetHistamine H3 receptor
LigandBDBM50092846
Substrate/Competitorn/a
Meas. Tech.ChEMBL_86763 (CHEMBL698663)
Ki 1.1±n/a nM
Citation Stark, HSadek, BKrause, MHüls, ALigneau, XGanellin, CRArrang, JMSchwartz, JCSchunack, W Novel histamine H(3)-receptor antagonists with carbonyl-substituted 4-(3-(phenoxy)propyl)-1H-imidazole structures like ciproxifan and related compounds. J Med Chem43:3987-94 (2000) Histamine H3 receptor
Name:Histamine H3 receptor
Type:G Protein-Coupled Receptor (GPCR)
Mol. Mass.:48607.98
Organism:Rattus norvegicus (rat)
Description:n/a
Residue:445
BDBM50092846
NameBDBM50092846
Synonyms:1-{2-Fluoro-4-[3-(1H-imidazol-4-yl)-propoxy]-phenyl}-ethanone; compound with but-2-enedioic acid(0.25M H2O) | CHEMBL129602
TypeSmall organic molecule
Emp. Form.C14H15FN2O2
Mol. Mass.262.2795
SMILESCC(=O)c1ccc(OCCCc2cnc[nH]2)cc1F