Reaction Details
TargetHistamine H3 receptor
LigandBDBM50092852
Substrate/Competitorn/a
Meas. Tech.ChEMBL_86763 (CHEMBL698663)
Ki 18±n/a nM
Citation Stark, HSadek, BKrause, MHüls, ALigneau, XGanellin, CRArrang, JMSchwartz, JCSchunack, W Novel histamine H(3)-receptor antagonists with carbonyl-substituted 4-(3-(phenoxy)propyl)-1H-imidazole structures like ciproxifan and related compounds. J Med Chem43:3987-94 (2000) Histamine H3 receptor
Name:Histamine H3 receptor
Type:G Protein-Coupled Receptor (GPCR)
Mol. Mass.:48607.98
Organism:Rattus norvegicus (rat)
Description:n/a
Residue:445
BDBM50092852
NameBDBM50092852
Synonyms:4-[3-(1H-Imidazol-4-yl)-propoxy]-phenol; compound with but-2-enedioic acid | CHEMBL128097
TypeSmall organic molecule
Emp. Form.C12H14N2O2
Mol. Mass.218.2518
SMILESOc1ccc(OCCCc2cnc[nH]2)cc1