Reaction Details
TargetHistamine H3 receptor
LigandBDBM50092854
Substrate/Competitorn/a
Meas. Tech.ChEMBL_86763 (CHEMBL698663)
Ki 20±n/a nM
Citation Stark, HSadek, BKrause, MHüls, ALigneau, XGanellin, CRArrang, JMSchwartz, JCSchunack, W Novel histamine H(3)-receptor antagonists with carbonyl-substituted 4-(3-(phenoxy)propyl)-1H-imidazole structures like ciproxifan and related compounds. J Med Chem43:3987-94 (2000) Histamine H3 receptor
Name:Histamine H3 receptor
Type:G Protein-Coupled Receptor (GPCR)
Mol. Mass.:48607.98
Organism:Rattus norvegicus (rat)
Description:n/a
Residue:445
BDBM50092854
NameBDBM50092854
Synonyms:4-{4-[3-(1H-Imidazol-4-yl)-propoxy]-phenyl}-but-3-en-2-one; compound with but-2-enedioic acid(0.5M H2O) | CHEMBL129607
TypeSmall organic molecule
Emp. Form.C16H18N2O2
Mol. Mass.270.3263
SMILESCC(=O)C=Cc1ccc(OCCCc2cnc[nH]2)cc1