Reaction Details
TargetHistamine H3 receptor
LigandBDBM50092862
Substrate/Competitorn/a
Meas. Tech.ChEMBL_86762 (CHEMBL698662)
Ki 17±n/a nM
Citation Stark, HSadek, BKrause, MHüls, ALigneau, XGanellin, CRArrang, JMSchwartz, JCSchunack, W Novel histamine H(3)-receptor antagonists with carbonyl-substituted 4-(3-(phenoxy)propyl)-1H-imidazole structures like ciproxifan and related compounds. J Med Chem43:3987-94 (2000) Histamine H3 receptor
Name:Histamine H3 receptor
Type:G Protein-Coupled Receptor (GPCR)
Mol. Mass.:48607.98
Organism:Rattus norvegicus (rat)
Description:n/a
Residue:445
BDBM50092862
NameBDBM50092862
Synonyms:5-[3-(1H-Imidazol-4-yl)-propoxy]-indan-1-one; compound with but-2-enedioic acid(H2O) | CHEMBL130952
TypeSmall organic molecule
Emp. Form.C15H16N2O2
Mol. Mass.256.2997
SMILESO=C1CCc2cc(OCCCc3cnc[nH]3)ccc12