Reaction Details
TargetHistamine H3 receptor
LigandBDBM50092861
Substrate/Competitorn/a
Meas. Tech.ChEMBL_86763 (CHEMBL698663)
Ki 325±n/a nM
Citation Stark, HSadek, BKrause, MHüls, ALigneau, XGanellin, CRArrang, JMSchwartz, JCSchunack, W Novel histamine H(3)-receptor antagonists with carbonyl-substituted 4-(3-(phenoxy)propyl)-1H-imidazole structures like ciproxifan and related compounds. J Med Chem43:3987-94 (2000) Histamine H3 receptor
Name:Histamine H3 receptor
Type:G Protein-Coupled Receptor (GPCR)
Mol. Mass.:48607.98
Organism:Rattus norvegicus (rat)
Description:n/a
Residue:445
BDBM50092861
NameBDBM50092861
Synonyms:1-{4-[3-(1H-Imidazol-4-yl)-propoxy]-2-methoxy-phenyl}-ethanone; compound with but-2-enedioic acid(0.5M H2O) | CHEMBL442762
TypeSmall organic molecule
Emp. Form.C15H18N2O3
Mol. Mass.274.315
SMILESCOc1cc(OCCCc2cnc[nH]2)ccc1C(C)=O