Reaction Details
TargetCyclin-dependent kinase 1
LigandBDBM7554
Substrate/Competitorn/a
Meas. Tech.ChEMBL_50319 (CHEMBL661624)
IC50 200±n/a nM
Citation Ducrot, PLegraverend, MGrierson, DS 3D-QSAR CoMFA on cyclin-dependent kinase inhibitors. J Med Chem43:4098-108 (2000) Cyclin-dependent kinase 1
Name:Cyclin-dependent kinase 1
Type:Enzyme Subunit
Mol. Mass.:34101.08
Organism:Homo sapiens (Human)
Description:P06493
Residue:297
BDBM7554
NameBDBM7554
Synonyms:5-[6-(benzylamino)-9-(propan-2-yl)-9H-purin-2-yl]pent-4-yn-1-ol CHEMBL134080
TypeSmall organic molecule
Emp. Form.C20H23N5O
Mol. Mass.349.4295
SMILESCC(C)n1cnc2c(NCc3ccccc3)nc(nc12)C#CCCCO