Reaction Details
TargetCyclin-dependent kinase 1
LigandBDBM50093407
Substrate/Competitorn/a
Meas. Tech.ChEMBL_50319 (CHEMBL661624)
IC50 20±n/a nM
Citation Ducrot, PLegraverend, MGrierson, DS 3D-QSAR CoMFA on cyclin-dependent kinase inhibitors. J Med Chem43:4098-108 (2000) Cyclin-dependent kinase 1
Name:Cyclin-dependent kinase 1
Type:Enzyme Subunit
Mol. Mass.:34101.08
Organism:Homo sapiens (Human)
Description:P06493
Residue:297
BDBM50093407
NameBDBM50093407
Synonyms:(R)2-{6-[(Benzo[1,3]dioxol-5-ylmethyl)-amino]-9-isopropyl-9H-purin-2-ylamino}-3-methyl-butan-1-ol | CHEMBL3085239
TypeSmall organic molecule
Emp. Form.C21H28N6O3
Mol. Mass.412.4854
SMILESCC(C)[C@H](CO)Nc1nc(NCc2ccc3OCOc3c2)c2ncn(C(C)C)c2n1