Reaction Details
TargetCyclin-dependent kinase 1
LigandBDBM7517
Substrate/Competitorn/a
Meas. Tech.ChEMBL_50319 (CHEMBL661624)
IC50 6500±n/a nM
Citation Ducrot, PLegraverend, MGrierson, DS 3D-QSAR CoMFA on cyclin-dependent kinase inhibitors. J Med Chem43:4098-108 (2000) Cyclin-dependent kinase 1
Name:Cyclin-dependent kinase 1
Type:Enzyme Subunit
Mol. Mass.:34101.08
Organism:Homo sapiens (Human)
Description:P06493
Residue:297
BDBM7517
NameBDBM7517
Synonyms:2,6,9-Trisubstituted purine deriv. 12 CHEMBL440717
TypeSmall organic molecule
Emp. Form.C23H26N6O
Mol. Mass.402.4921
SMILESCC(C)n1cnc2c(NCc3ccccc3)nc(NCC(O)c3ccccc3)nc12